Reaction Details
Targetm7GpppX diphosphatase
LigandBDBM36534
Substrate/Competitorn/a
Meas. Tech.ChEMBL_1660723 (CHEMBL4010335)
IC50 0.320000±n/a nM
Citation Gopalsamy, ANarayanan, ALiu, SParikh, MDKyne, REFadeyi, OTones, MACherry, JJNabhan, JFLaRosa, GPetersen, DNMenard, CFoley, TLNoell, SRen, YLoria, PMMaglich-Goodwin, JRong, HJones, LH Design of Potent mRNA Decapping Scavenger Enzyme (DcpS) Inhibitors with Improved Physicochemical Properties To Investigate the Mechanism of Therapeutic Benefit in Spinal Muscular Atrophy (SMA). J Med Chem60:3094-3108 (2017) 
 
m7GpppX diphosphatase
Name:m7GpppX diphosphatase
Type:Enzyme
Mol. Mass.:38606.80
Organism:Homo sapiens (Human)
Description:Q96C86
Residue:337
BDBM36534
NameBDBM36534
Synonyms:D156095
TypeSmall organic molecule
Emp. Form.C21H23Cl2N5O
Mol. Mass.432.346
SMILESNc1nc(N)c2c(OCC3CCN(Cc4ccc(Cl)c(Cl)c4)CC3)cccc2n1