Reaction Details
TargetSolute carrier family 22 member 1
LigandBDBM8961
Substrate/Competitorn/a
Meas. Tech.ChEBML_1659987
IC50 21720±n/a nM
Citation Chen, ECKhuri, NLiang, XStecula, AChien, HCYee, SWHuang, YSali, AGiacomini, KM Discovery of Competitive and Noncompetitive Ligands of the Organic Cation Transporter 1 (OCT1; SLC22A1). J Med Chem60:2685-2696 (2017) 
 
Solute carrier family 22 member 1
Name:Solute carrier family 22 member 1
Type:Enzyme Catalytic Domain
Mol. Mass.:61154.85
Organism:Homo sapiens (Human)
Description:Adrenergic Alpha 0 HUMAN::O15245
Residue:554
BDBM8961
NameBDBM8961
Synonyms:1,2,3,4-tetrahydro-9-acridinamine 9-THA CHEMBL1337960 Cognex Tracine cid_1935 | tacrine.HCl
TypeSmall organic molecule
Emp. Form.C13H14N2
Mol. Mass.198.2637
SMILESNc1c2CCCCc2nc2ccccc12