Reaction Details
TargetSolute carrier family 22 member 1
LigandBDBM36880
Substrate/Competitorn/a
Meas. Tech.ChEBML_1659987
IC50 2230±n/a nM
Citation Chen, ECKhuri, NLiang, XStecula, AChien, HCYee, SWHuang, YSali, AGiacomini, KM Discovery of Competitive and Noncompetitive Ligands of the Organic Cation Transporter 1 (OCT1; SLC22A1). J Med Chem60:2685-2696 (2017) 
 
Solute carrier family 22 member 1
Name:Solute carrier family 22 member 1
Type:Enzyme Catalytic Domain
Mol. Mass.:61154.85
Organism:Homo sapiens (Human)
Description:Adrenergic Alpha 0 HUMAN::O15245
Residue:554
BDBM36880
NameBDBM36880
Synonyms:2,2'-THIOBIS(4,6-DICHLOROPHENOL) 2,4-dichloro-6-[(3,5-dichloro-2-hydroxy-phenyl)thio]phenol 2-[3,5-bis(chloranyl)-2-oxidanyl-phenyl]sulfanyl-4,6-bis(chloranyl)phenol HL-3 SMR000058374 | cid_2406
TypeSmall organic molecule
Emp. Form.C12H6Cl4O2S
Mol. Mass.356.052
SMILESOc1c(Cl)cc(Cl)cc1Sc1cc(Cl)cc(Cl)c1O