Reaction Details
TargetMitogen-activated protein kinase kinase kinase 5
LigandBDBM50212258
Substrate/Competitorn/a
Meas. Tech.ChEMBL_1661519 (CHEMBL4011131)
IC50 5.0±n/a nM
Citation Gibson, TSJohnson, BFanjul, AHalkowycz, PDougan, DRCole, DSwann, S Structure-based drug design of novel ASK1 inhibitors using an integrated lead optimization strategy. Bioorg Med Chem Lett27:1709-1713 (2017) 
 
Mitogen-activated protein kinase kinase kinase 5
Name:Mitogen-activated protein kinase kinase kinase 5
Type:Protein
Mol. Mass.:154514.93
Organism:Homo sapiens (Human)
Description:Q99683
Residue:1374
BDBM50212258
NameBDBM50212258
Synonyms:GS-4997 | Selonsertib
TypeSmall organic molecule
Emp. Form.C24H24FN7O
Mol. Mass.445.4921
SMILESCC(C)n1cnnc1-c1cccc(NC(=O)c2cc(c(C)cc2F)-n2cnc(c2)C2CC2)n1