Reaction Details
Target[Pyruvate dehydrogenase (acetyl-transferring)] kinase isozyme 3, mitochondrial
LigandBDBM50236039
Substrate/Competitorn/a
Meas. Tech.ChEBML_1660050
Ki 2980±n/a nM
Citation Liu, YXie, ZZhao, DZhu, JMao, FTang, SXu, HLuo, CGeng, MHuang, MLi, J Development of the First Generation of Disulfide-Based Subtype-Selective and Potent Covalent Pyruvate Dehydrogenase Kinase 1 (PDK1) Inhibitors. J Med Chem60:2227-2244 (2017) 
 
[Pyruvate dehydrogenase (acetyl-transferring)] kinase isozyme 3, mitochondrial
Name:[Pyruvate dehydrogenase (acetyl-transferring)] kinase isozyme 3, mitochondrial
Type:Enzyme
Mol. Mass.:46944.89
Organism:Homo sapiens (Human)
Description:Q15120
Residue:406
BDBM50236039
NameBDBM50236039
Synonyms:CHEMBL4092859
TypeSmall organic molecule
Emp. Form.C14H24N2O4S4
Mol. Mass.412.611
SMILESCOC[C@@H]1COCCN1C(=S)SSC(=S)N1CCOC[C@H]1COC