Reaction Details
Target[Pyruvate dehydrogenase (acetyl-transferring)] kinase isozyme 2, mitochondrial
LigandBDBM50237390
Substrate/Competitorn/a
Meas. Tech.ChEMBL_1660039 (CHEMBL4009651)
Ki 1270±n/a nM
Citation Liu, YXie, ZZhao, DZhu, JMao, FTang, SXu, HLuo, CGeng, MHuang, MLi, J Development of the First Generation of Disulfide-Based Subtype-Selective and Potent Covalent Pyruvate Dehydrogenase Kinase 1 (PDK1) Inhibitors. J Med Chem60:2227-2244 (2017) 
 
[Pyruvate dehydrogenase (acetyl-transferring)] kinase isozyme 2, mitochondrial
Name:[Pyruvate dehydrogenase (acetyl-transferring)] kinase isozyme 2, mitochondrial
Type:Enzyme
Mol. Mass.:46153.78
Organism:Homo sapiens (Human)
Description:Q15119
Residue:407
BDBM50237390
NameBDBM50237390
Synonyms:CHEMBL4099635
TypeSmall organic molecule
Emp. Form.C12H20N2O2S4
Mol. Mass.352.559
SMILESS=C(SSC(=S)N1CCCOCC1)N1CCCOCC1