Reaction Details
TargetTyrosine-protein kinase SYK
LigandBDBM50275935
Substrate/Competitorn/a
Meas. Tech.ChEMBL_1660848 (CHEMBL4010460)
IC50 6.0±n/a nM
Citation Huang, YZhang, YFan, KDong, GLi, BZhang, WLi, JSheng, C Discovery of new Syk inhibitors through structure-based virtual screening. Bioorg Med Chem Lett27:1776-1779 (2017) 
 
Tyrosine-protein kinase SYK
Name:Tyrosine-protein kinase SYK
Type:Enzyme
Mol. Mass.:72079.99
Organism:Homo sapiens (Human)
Description:P43405
Residue:635
BDBM50275935
NameBDBM50275935
Synonyms:(S)-2-(2-(3,5-dimethylphenylamino)pyrimidin-4-yl)-N-(1-hydroxypropan-2-yl)-4-methylthiazole-5-carboxamide CHEMBL512172
TypeSmall organic molecule
Emp. Form.C20H23N5O2S
Mol. Mass.397.494
SMILESC[C@@H](CO)NC(=O)c1sc(nc1C)-c1ccnc(Nc2cc(C)cc(C)c2)n1