Reaction Details
TargetCarbonic anhydrase 5B, mitochondrial
LigandBDBM50237494
Substrate/Competitorn/a
Meas. Tech.ChEMBL_1660854 (CHEMBL4010466)
Ki 35±n/a nM
Citation Carta, FBirkmann, APfaff, TBuschmann, HSchwab, WZimmermann, HMaresca, ASupuran, CT Lead Development of Thiazolylsulfonamides with Carbonic Anhydrase Inhibitory Action. J Med Chem60:3154-3164 (2017) 
 
Carbonic anhydrase 5B, mitochondrial
Name:Carbonic anhydrase 5B, mitochondrial
Type:Enzyme
Mol. Mass.:36440.83
Organism:Homo sapiens (Human)
Description:Human (cloned) isozyme
Residue:317
BDBM50237494
NameBDBM50237494
Synonyms:CHEMBL4092630
TypeSmall organic molecule
Emp. Form.C22H23N3O3S2
Mol. Mass.441.566
SMILESCN(C(=O)Cc1ccc(cc1)-c1ccccc1)c1nc(C)c(s1)S(=O)(=O)NC1CC1