Reaction Details
TargetCarbonic anhydrase 5B, mitochondrial
LigandBDBM50237360
Substrate/Competitorn/a
Meas. Tech.ChEMBL_1660854 (CHEMBL4010466)
Ki 38±n/a nM
Citation Carta, FBirkmann, APfaff, TBuschmann, HSchwab, WZimmermann, HMaresca, ASupuran, CT Lead Development of Thiazolylsulfonamides with Carbonic Anhydrase Inhibitory Action. J Med Chem60:3154-3164 (2017) 
 
Carbonic anhydrase 5B, mitochondrial
Name:Carbonic anhydrase 5B, mitochondrial
Type:Enzyme
Mol. Mass.:36440.83
Organism:Homo sapiens (Human)
Description:Human (cloned) isozyme
Residue:317
BDBM50237360
NameBDBM50237360
Synonyms:CHEMBL4084865
TypeSmall organic molecule
Emp. Form.C19H21ClN4O3S2
Mol. Mass.452.978
SMILESCl.CNS(=O)(=O)c1sc(nc1C)N(C)C(=O)Cc1ccc(cc1)-c1ccccn1