Reaction Details
TargetCarbonic anhydrase 2
LigandBDBM50237364
Substrate/Competitorn/a
Meas. Tech.ChEMBL_1660852 (CHEMBL4010464)
Ki 10±n/a nM
Citation Carta, FBirkmann, APfaff, TBuschmann, HSchwab, WZimmermann, HMaresca, ASupuran, CT Lead Development of Thiazolylsulfonamides with Carbonic Anhydrase Inhibitory Action. J Med Chem60:3154-3164 (2017) 
 
Carbonic anhydrase 2
Name:Carbonic anhydrase 2
Type:Enzyme
Mol. Mass.:29250.71
Organism:Homo sapiens (Human)
Description:P00918
Residue:260
BDBM50237364
NameBDBM50237364
Synonyms:CHEMBL4073528
TypeSmall organic molecule
Emp. Form.C18H18N4O4S2
Mol. Mass.418.49
SMILESCN(C(=O)Cc1ccc(cc1)-c1ccccn1)c1nc(CO)c(s1)S(N)(=O)=O