Reaction Details
TargetCarbonic anhydrase 9
LigandBDBM50237362
Substrate/Competitorn/a
Meas. Tech.ChEMBL_1660855 (CHEMBL4010467)
Ki 45±n/a nM
Citation Carta, FBirkmann, APfaff, TBuschmann, HSchwab, WZimmermann, HMaresca, ASupuran, CT Lead Development of Thiazolylsulfonamides with Carbonic Anhydrase Inhibitory Action. J Med Chem60:3154-3164 (2017) 
 
Carbonic anhydrase 9
Name:Carbonic anhydrase 9
Type:Enzyme
Mol. Mass.:49669.03
Organism:Homo sapiens (Human)
Description:Catalytic domain of human cloned isozyme was used in the assay
Residue:459
BDBM50237362
NameBDBM50237362
Synonyms:CHEMBL4064934
TypeSmall organic molecule
Emp. Form.C21H23N3O4S2
Mol. Mass.445.555
SMILESCN(C(=O)Cc1ccc(cc1)-c1ccccc1)c1nc(C)c(s1)S(=O)(=O)NCCO