Reaction Details
TargetCarbonic anhydrase 5B, mitochondrial
LigandBDBM50237369
Substrate/Competitorn/a
Meas. Tech.ChEMBL_1660854 (CHEMBL4010466)
Ki 68±n/a nM
Citation Carta, FBirkmann, APfaff, TBuschmann, HSchwab, WZimmermann, HMaresca, ASupuran, CT Lead Development of Thiazolylsulfonamides with Carbonic Anhydrase Inhibitory Action. J Med Chem60:3154-3164 (2017) 
 
Carbonic anhydrase 5B, mitochondrial
Name:Carbonic anhydrase 5B, mitochondrial
Type:Enzyme
Mol. Mass.:36440.83
Organism:Homo sapiens (Human)
Description:Human (cloned) isozyme
Residue:317
BDBM50237369
NameBDBM50237369
Synonyms:CHEMBL4084758
TypeSmall organic molecule
Emp. Form.C21H21N3O3S2
Mol. Mass.427.54
SMILESCc1nc(sc1S(N)(=O)=O)N(C1CC1)C(=O)Cc1ccc(cc1)-c1ccccc1