Reaction Details
TargetCarbonic anhydrase 1
LigandBDBM50237369
Substrate/Competitorn/a
Meas. Tech.ChEMBL_1660851 (CHEMBL4010463)
Ki 55±n/a nM
Citation Carta, FBirkmann, APfaff, TBuschmann, HSchwab, WZimmermann, HMaresca, ASupuran, CT Lead Development of Thiazolylsulfonamides with Carbonic Anhydrase Inhibitory Action. J Med Chem60:3154-3164 (2017) 
 
Carbonic anhydrase 1
Name:Carbonic anhydrase 1
Type:Enzyme
Mol. Mass.:28873.37
Organism:Homo sapiens (Human)
Description:P00915
Residue:261
BDBM50237369
NameBDBM50237369
Synonyms:CHEMBL4084758
TypeSmall organic molecule
Emp. Form.C21H21N3O3S2
Mol. Mass.427.54
SMILESCc1nc(sc1S(N)(=O)=O)N(C1CC1)C(=O)Cc1ccc(cc1)-c1ccccc1