Reaction Details
TargetCarbonic anhydrase 12
LigandBDBM50237495
Substrate/Competitorn/a
Meas. Tech.ChEMBL_1660856 (CHEMBL4010468)
Ki 5.5±n/a nM
Citation Carta, FBirkmann, APfaff, TBuschmann, HSchwab, WZimmermann, HMaresca, ASupuran, CT Lead Development of Thiazolylsulfonamides with Carbonic Anhydrase Inhibitory Action. J Med Chem60:3154-3164 (2017) 
 
Carbonic anhydrase 12
Name:Carbonic anhydrase 12
Type:Enzyme
Mol. Mass.:39456.00
Organism:Homo sapiens (Human)
Description:Catalytic domain of human cloned isozyme was used in the assay
Residue:354
BDBM50237495
NameBDBM50237495
Synonyms:CHEMBL4092504
TypeSmall organic molecule
Emp. Form.C19H18FN3O3S2
Mol. Mass.419.493
SMILESCN(C(=O)Cc1ccc(cc1)-c1cccc(F)c1)c1nc(C)c(s1)S(N)(=O)=O