Reaction Details
TargetSphingosine kinase 1
LigandBDBM50237416
Substrate/Competitorn/a
Meas. Tech.ChEMBL_1660109 (CHEMBL4009721)
IC50 142±n/a nM
Citation Schnute, MEMcReynolds, MDCarroll, JChrencik, JHighkin, MKIyanar, KJerome, GRains, JWSaabye, MScholten, JAYates, MNagiec, MM Discovery of a Potent and Selective Sphingosine Kinase 1 Inhibitor through the Molecular Combination of Chemotype-Distinct Screening Hits. J Med Chem60:2562-2572 (2017) 
 
Sphingosine kinase 1
Name:Sphingosine kinase 1
Type:Enzyme
Mol. Mass.:42521.16
Organism:Homo sapiens (Human)
Description:Q9NYA1
Residue:384
BDBM50237416
NameBDBM50237416
Synonyms:CHEMBL3348835
TypeSmall organic molecule
Emp. Form.C27H31NO4S
Mol. Mass.465.604
SMILESCc1cc(CS(=O)(=O)c2ccccc2)cc(OCc2ccc(CN3CCC[C@H]3CO)cc2)c1