Reaction Details
TargetSphingosine kinase 1
LigandBDBM50237417
Substrate/Competitorn/a
Meas. Tech.ChEMBL_1660110 (CHEMBL4009722)
IC50 3.0±n/a nM
Citation Schnute, MEMcReynolds, MDCarroll, JChrencik, JHighkin, MKIyanar, KJerome, GRains, JWSaabye, MScholten, JAYates, MNagiec, MM Discovery of a Potent and Selective Sphingosine Kinase 1 Inhibitor through the Molecular Combination of Chemotype-Distinct Screening Hits. J Med Chem60:2562-2572 (2017) 
 
Sphingosine kinase 1
Name:Sphingosine kinase 1
Type:Enzyme
Mol. Mass.:42521.16
Organism:Homo sapiens (Human)
Description:Q9NYA1
Residue:384
BDBM50237417
NameBDBM50237417
Synonyms:CHEMBL4077280
TypeSmall organic molecule
Emp. Form.C26H29NO4S
Mol. Mass.451.578
SMILESCc1cc(CS(=O)(=O)c2ccccc2)cc(OCc2ccc(CN3CC[C@H](O)C3)cc2)c1