Reaction Details
TargetSphingosine kinase 2
LigandBDBM50237417
Substrate/Competitorn/a
Meas. Tech.ChEMBL_1660111 (CHEMBL4009723)
IC50 443±n/a nM
Citation Schnute, MEMcReynolds, MDCarroll, JChrencik, JHighkin, MKIyanar, KJerome, GRains, JWSaabye, MScholten, JAYates, MNagiec, MM Discovery of a Potent and Selective Sphingosine Kinase 1 Inhibitor through the Molecular Combination of Chemotype-Distinct Screening Hits. J Med Chem60:2562-2572 (2017) 
 
Sphingosine kinase 2
Name:Sphingosine kinase 2
Type:Protein
Mol. Mass.:69221.44
Organism:Homo sapiens (Human)
Description:Q9NRA0
Residue:654
BDBM50237417
NameBDBM50237417
Synonyms:CHEMBL4077280
TypeSmall organic molecule
Emp. Form.C26H29NO4S
Mol. Mass.451.578
SMILESCc1cc(CS(=O)(=O)c2ccccc2)cc(OCc2ccc(CN3CC[C@H](O)C3)cc2)c1