Reaction Details
TargetSphingosine kinase 1
LigandBDBM50237433
Substrate/Competitorn/a
Meas. Tech.ChEMBL_1660112 (CHEMBL4009724)
IC50 1200±n/a nM
Citation Schnute, MEMcReynolds, MDCarroll, JChrencik, JHighkin, MKIyanar, KJerome, GRains, JWSaabye, MScholten, JAYates, MNagiec, MM Discovery of a Potent and Selective Sphingosine Kinase 1 Inhibitor through the Molecular Combination of Chemotype-Distinct Screening Hits. J Med Chem60:2562-2572 (2017) 
 
Sphingosine kinase 1
Name:Sphingosine kinase 1
Type:Enzyme
Mol. Mass.:42521.16
Organism:Homo sapiens (Human)
Description:Q9NYA1
Residue:384
BDBM50237433
NameBDBM50237433
Synonyms:CHEMBL4063506
TypeSmall organic molecule
Emp. Form.C26H28N2O3
Mol. Mass.416.5121
SMILESOC[C@H]1CCCN1Cc1ccc(COc2cccc(NC(=O)c3ccccc3)c2)cc1