Reaction Details
TargetSphingosine 1-phosphate receptor 3
LigandBDBM50237424
Substrate/Competitorn/a
Meas. Tech.ChEMBL_1660116 (CHEMBL4009728)
IC50>10000±n/a nM
Citation Schnute, MEMcReynolds, MDCarroll, JChrencik, JHighkin, MKIyanar, KJerome, GRains, JWSaabye, MScholten, JAYates, MNagiec, MM Discovery of a Potent and Selective Sphingosine Kinase 1 Inhibitor through the Molecular Combination of Chemotype-Distinct Screening Hits. J Med Chem60:2562-2572 (2017) 
 
Sphingosine 1-phosphate receptor 3
Name:Sphingosine 1-phosphate receptor 3
Type:G Protein-Coupled Receptor (GPCR)
Mol. Mass.:42278.13
Organism:Homo sapiens (Human)
Description:Q99500
Residue:378
BDBM50237424
NameBDBM50237424
Synonyms:CHEMBL4101573
TypeSmall organic molecule
Emp. Form.C22H21N3O3S
Mol. Mass.407.485
SMILESCc1cc(CS(=O)(=O)c2ccccc2)cc(OCc2ccc3[nH]c(N)nc3c2)c1