Reaction Details
TargetSphingosine kinase 1
LigandBDBM50237431
Substrate/Competitorn/a
Meas. Tech.ChEMBL_1660119 (CHEMBL4009731)
IC50 38±n/a nM
Citation Schnute, MEMcReynolds, MDCarroll, JChrencik, JHighkin, MKIyanar, KJerome, GRains, JWSaabye, MScholten, JAYates, MNagiec, MM Discovery of a Potent and Selective Sphingosine Kinase 1 Inhibitor through the Molecular Combination of Chemotype-Distinct Screening Hits. J Med Chem60:2562-2572 (2017) 
 
Sphingosine kinase 1
Name:Sphingosine kinase 1
Type:Enzyme
Mol. Mass.:42521.16
Organism:Homo sapiens (Human)
Description:Q9NYA1
Residue:384
BDBM50237431
NameBDBM50237431
Synonyms:CHEMBL4063424
TypeSmall organic molecule
Emp. Form.C26H29NO5S
Mol. Mass.467.577
SMILESCc1cc(CS(=O)(=O)c2ccccc2)cc(OCc2ccc(CN3C[C@H](O)[C@H](O)C3)cc2)c1