Reaction Details
TargetSphingosine kinase 1
LigandBDBM50237435
Substrate/Competitorn/a
Meas. Tech.ChEMBL_1660119 (CHEMBL4009731)
IC50 1.5±n/a nM
Citation Schnute, MEMcReynolds, MDCarroll, JChrencik, JHighkin, MKIyanar, KJerome, GRains, JWSaabye, MScholten, JAYates, MNagiec, MM Discovery of a Potent and Selective Sphingosine Kinase 1 Inhibitor through the Molecular Combination of Chemotype-Distinct Screening Hits. J Med Chem60:2562-2572 (2017) 
 
Sphingosine kinase 1
Name:Sphingosine kinase 1
Type:Enzyme
Mol. Mass.:42521.16
Organism:Homo sapiens (Human)
Description:Q9NYA1
Residue:384
BDBM50237435
NameBDBM50237435
Synonyms:CHEMBL4066270
TypeSmall organic molecule
Emp. Form.C25H33NO2
Mol. Mass.379.535
SMILESOC[C@H]1CCCN1Cc1ccc(COc2cccc(c2)C2CCCCC2)cc1