Reaction Details
TargetSphingosine kinase 1
LigandBDBM50237434
Substrate/Competitorn/a
Meas. Tech.ChEMBL_1660109 (CHEMBL4009721)
IC50 12700±n/a nM
Citation Schnute, MEMcReynolds, MDCarroll, JChrencik, JHighkin, MKIyanar, KJerome, GRains, JWSaabye, MScholten, JAYates, MNagiec, MM Discovery of a Potent and Selective Sphingosine Kinase 1 Inhibitor through the Molecular Combination of Chemotype-Distinct Screening Hits. J Med Chem60:2562-2572 (2017) 
 
Sphingosine kinase 1
Name:Sphingosine kinase 1
Type:Enzyme
Mol. Mass.:42521.16
Organism:Homo sapiens (Human)
Description:Q9NYA1
Residue:384
BDBM50237434
NameBDBM50237434
Synonyms:CHEMBL4067356
TypeSmall organic molecule
Emp. Form.C25H31N3O2
Mol. Mass.405.5325
SMILESCc1nc2ccc(cc2n1C[C@@H]1CCCO1)-c1ccc(CN2CCC[C@@H]2CO)cc1