Reaction Details
TargetGlutaminyl-peptide cyclotransferase
LigandBDBM50299853
Substrate/Competitorn/a
Meas. Tech.ChEMBL_1660123 (CHEMBL4009735)
IC50 22±n/a nM
Citation Hoang, VHTran, PTCui, MNgo, VTAnn, JPark, JLee, JChoi, KCho, HKim, HHa, HJHong, HSChoi, SKim, YHLee, J Discovery of Potent Human Glutaminyl Cyclase Inhibitors as Anti-Alzheimer's Agents Based on Rational Design. J Med Chem60:2573-2590 (2017) 
 
Glutaminyl-peptide cyclotransferase
Name:Glutaminyl-peptide cyclotransferase
Type:Enzyme
Mol. Mass.:41122.35
Organism:Mus musculus (mouse)
Description:n/a
Residue:362
BDBM50299853
NameBDBM50299853
Synonyms:1-(3,4-Dimethoxyphenyl)-3-(3-(5-methyl-1H-imidazol-1-yl)propyl)thiourea US9656991, 1
TypeSmall organic molecule
Emp. Form.C16H22N4O2S
Mol. Mass.334.436
SMILESCOc1ccc(NC(=S)NCCCn2cncc2C)cc1OC