Reaction Details
TargetSodium channel protein type 9 subunit alpha
LigandBDBM50237490
Substrate/Competitorn/a
Meas. Tech.ChEBML_1660138
IC50 900±n/a nM
Citation Wu, YJGuernon, JShi, JDitta, JRobbins, KJRajamani, REaston, ANewton, ABourin, CMosure, KSoars, MGKnox, RJMatchett, MPieschl, RLPost-Munson, DJWang, SHerrington, JGraef, JNewberry, KBristow, LJMeanwell, NAOlson, RThompson, LADzierba, C Development of New Benzenesulfonamides As Potent and Selective Na J Med Chem60:2513-2525 (2017) 
 
Sodium channel protein type 9 subunit alpha
Name:Sodium channel protein type 9 subunit alpha
Type:Protein
Mol. Mass.:226375.97
Organism:Homo sapiens (Human)
Description:Q15858
Residue:1988
BDBM50237490
NameBDBM50237490
Synonyms:CHEMBL4078527
TypeSmall organic molecule
Emp. Form.C20H19ClF2N4O3S2
Mol. Mass.500.97
SMILESFc1cc(c(F)cc1OCC1(CCNCC1)c1ccc(Cl)cc1)S(=O)(=O)Nc1ncns1