Reaction Details
TargetSodium channel protein type 9 subunit alpha
LigandBDBM50237528
Substrate/Competitorn/a
Meas. Tech.ChEMBL_1660140 (CHEMBL4009752)
IC50 30±n/a nM
Citation Wu, YJGuernon, JShi, JDitta, JRobbins, KJRajamani, REaston, ANewton, ABourin, CMosure, KSoars, MGKnox, RJMatchett, MPieschl, RLPost-Munson, DJWang, SHerrington, JGraef, JNewberry, KBristow, LJMeanwell, NAOlson, RThompson, LADzierba, C Development of New Benzenesulfonamides As Potent and Selective Na J Med Chem60:2513-2525 (2017) 
 
Sodium channel protein type 9 subunit alpha
Name:Sodium channel protein type 9 subunit alpha
Type:PROTEIN
Mol. Mass.:225808.99
Organism:Mus musculus
Description:ChEMBL_109594
Residue:1984
BDBM50237528
NameBDBM50237528
Synonyms:CHEMBL4064193
TypeSmall organic molecule
Emp. Form.C19H26ClFN4O2S2
Mol. Mass.461.017
SMILESCN1C(C)(C)CC(CC1(C)C)Nc1cc(F)c(cc1Cl)S(=O)(=O)Nc1nccs1