Reaction Details
TargetSodium channel protein type 9 subunit alpha
LigandBDBM50237503
Substrate/Competitorn/a
Meas. Tech.ChEMBL_1660138 (CHEMBL4009750)
IC50 78±n/a nM
Citation Wu, YJGuernon, JShi, JDitta, JRobbins, KJRajamani, REaston, ANewton, ABourin, CMosure, KSoars, MGKnox, RJMatchett, MPieschl, RLPost-Munson, DJWang, SHerrington, JGraef, JNewberry, KBristow, LJMeanwell, NAOlson, RThompson, LADzierba, C Development of New Benzenesulfonamides As Potent and Selective Na J Med Chem60:2513-2525 (2017) 
 
Sodium channel protein type 9 subunit alpha
Name:Sodium channel protein type 9 subunit alpha
Type:Protein
Mol. Mass.:226375.97
Organism:Homo sapiens (Human)
Description:Q15858
Residue:1988
BDBM50237503
NameBDBM50237503
Synonyms:CHEMBL4093720
TypeSmall organic molecule
Emp. Form.C17H22F2N4O3S2
Mol. Mass.432.508
SMILESC[C@@]1(CCOc2cc(F)c(cc2F)S(=O)(=O)Nc2ncns2)CC[C@H](N)CC1