Reaction Details
TargetSodium channel protein type 9 subunit alpha
LigandBDBM50237499
Substrate/Competitorn/a
Meas. Tech.ChEMBL_1660138 (CHEMBL4009750)
IC50 16±n/a nM
Citation Wu, YJGuernon, JShi, JDitta, JRobbins, KJRajamani, REaston, ANewton, ABourin, CMosure, KSoars, MGKnox, RJMatchett, MPieschl, RLPost-Munson, DJWang, SHerrington, JGraef, JNewberry, KBristow, LJMeanwell, NAOlson, RThompson, LADzierba, C Development of New Benzenesulfonamides As Potent and Selective Na J Med Chem60:2513-2525 (2017) 
 
Sodium channel protein type 9 subunit alpha
Name:Sodium channel protein type 9 subunit alpha
Type:Protein
Mol. Mass.:226375.97
Organism:Homo sapiens (Human)
Description:Q15858
Residue:1988
BDBM50237499
NameBDBM50237499
Synonyms:CHEMBL4076627 | US10836758, Example 19
TypeSmall organic molecule
Emp. Form.C15H19ClFN5O2S2
Mol. Mass.419.925
SMILESN[C@H]1CC[C@@H](CNc2cc(F)c(cc2Cl)S(=O)(=O)Nc2ncns2)CC1