Reaction Details
TargetSodium channel protein type 9 subunit alpha
LigandBDBM50237507
Substrate/Competitorn/a
Meas. Tech.ChEMBL_1660138 (CHEMBL4009750)
IC50 458±n/a nM
Citation Wu, YJGuernon, JShi, JDitta, JRobbins, KJRajamani, REaston, ANewton, ABourin, CMosure, KSoars, MGKnox, RJMatchett, MPieschl, RLPost-Munson, DJWang, SHerrington, JGraef, JNewberry, KBristow, LJMeanwell, NAOlson, RThompson, LADzierba, C Development of New Benzenesulfonamides As Potent and Selective Na J Med Chem60:2513-2525 (2017) 
 
Sodium channel protein type 9 subunit alpha
Name:Sodium channel protein type 9 subunit alpha
Type:Protein
Mol. Mass.:226375.97
Organism:Homo sapiens (Human)
Description:Q15858
Residue:1988
BDBM50237507
NameBDBM50237507
Synonyms:CHEMBL4098978
TypeSmall organic molecule
Emp. Form.C22H24ClFN4O3S2
Mol. Mass.511.032
SMILESN[C@H]1CC[C@](CCOc2cc(F)c(cc2Cl)S(=O)(=O)Nc2ncns2)(CC1)c1ccccc1