Reaction Details
TargetSodium channel protein type 9 subunit alpha
LigandBDBM50237501
Substrate/Competitorn/a
Meas. Tech.ChEMBL_1660138 (CHEMBL4009750)
IC50 339±n/a nM
Citation Wu, YJGuernon, JShi, JDitta, JRobbins, KJRajamani, REaston, ANewton, ABourin, CMosure, KSoars, MGKnox, RJMatchett, MPieschl, RLPost-Munson, DJWang, SHerrington, JGraef, JNewberry, KBristow, LJMeanwell, NAOlson, RThompson, LADzierba, C Development of New Benzenesulfonamides As Potent and Selective Na J Med Chem60:2513-2525 (2017) 
 
Sodium channel protein type 9 subunit alpha
Name:Sodium channel protein type 9 subunit alpha
Type:Protein
Mol. Mass.:226375.97
Organism:Homo sapiens (Human)
Description:Q15858
Residue:1988
BDBM50237501
NameBDBM50237501
Synonyms:CHEMBL4071551 | US10836758, Example 15
TypeSmall organic molecule
Emp. Form.C13H14ClFN4O2S2
Mol. Mass.376.857
SMILESFc1cc(NCC2CNC2)c(Cl)cc1S(=O)(=O)Nc1nccs1