Reaction Details
TargetSodium channel protein type 9 subunit alpha
LigandBDBM50237517
Substrate/Competitorn/a
Meas. Tech.ChEMBL_1660141 (CHEMBL4009753)
IC50 12±n/a nM
Citation Wu, YJGuernon, JShi, JDitta, JRobbins, KJRajamani, REaston, ANewton, ABourin, CMosure, KSoars, MGKnox, RJMatchett, MPieschl, RLPost-Munson, DJWang, SHerrington, JGraef, JNewberry, KBristow, LJMeanwell, NAOlson, RThompson, LADzierba, C Development of New Benzenesulfonamides As Potent and Selective Na J Med Chem60:2513-2525 (2017) 
 
Sodium channel protein type 9 subunit alpha
Name:Sodium channel protein type 9 subunit alpha
Type:PROTEIN
Mol. Mass.:226035.47
Organism:Rattus norvegicus
Description:ChEMBL_1516887
Residue:1984
BDBM50237517
NameBDBM50237517
Synonyms:CHEMBL4078268 | US10836758, Example 20
TypeSmall organic molecule
Emp. Form.C16H20ClFN4O2S2
Mol. Mass.418.937
SMILESN[C@H]1CC[C@@H](CNc2cc(F)c(cc2Cl)S(=O)(=O)Nc2nccs2)CC1