Reaction Details
TargetSodium channel protein type 9 subunit alpha
LigandBDBM50237526
Substrate/Competitorn/a
Meas. Tech.ChEMBL_1660140 (CHEMBL4009752)
IC50 51±n/a nM
Citation Wu, YJGuernon, JShi, JDitta, JRobbins, KJRajamani, REaston, ANewton, ABourin, CMosure, KSoars, MGKnox, RJMatchett, MPieschl, RLPost-Munson, DJWang, SHerrington, JGraef, JNewberry, KBristow, LJMeanwell, NAOlson, RThompson, LADzierba, C Development of New Benzenesulfonamides As Potent and Selective Na J Med Chem60:2513-2525 (2017) 
 
Sodium channel protein type 9 subunit alpha
Name:Sodium channel protein type 9 subunit alpha
Type:PROTEIN
Mol. Mass.:225808.99
Organism:Mus musculus
Description:ChEMBL_109594
Residue:1984
BDBM50237526
NameBDBM50237526
Synonyms:CHEMBL4092078 | US10836758, Example 12
TypeSmall organic molecule
Emp. Form.C18H22ClFN4O2S2
Mol. Mass.444.974
SMILESFc1cc(NCC2(CN3CCCC3)CC2)c(Cl)cc1S(=O)(=O)Nc1nccs1