Reaction Details
TargetSodium channel protein type 5 subunit alpha
LigandBDBM50237511
Substrate/Competitorn/a
Meas. Tech.ChEMBL_1660139 (CHEMBL4009751)
IC50>30000±n/a nM
Citation Wu, YJGuernon, JShi, JDitta, JRobbins, KJRajamani, REaston, ANewton, ABourin, CMosure, KSoars, MGKnox, RJMatchett, MPieschl, RLPost-Munson, DJWang, SHerrington, JGraef, JNewberry, KBristow, LJMeanwell, NAOlson, RThompson, LADzierba, C Development of New Benzenesulfonamides As Potent and Selective Na J Med Chem60:2513-2525 (2017) 
 
Sodium channel protein type 5 subunit alpha
Name:Sodium channel protein type 5 subunit alpha
Type:Enzyme
Mol. Mass.:226908.60
Organism:Homo sapiens (Human)
Description:Q14524
Residue:2016
BDBM50237511
NameBDBM50237511
Synonyms:CHEMBL4072007
TypeSmall organic molecule
Emp. Form.C23H26F2N4O3S2
Mol. Mass.508.604
SMILESCN[C@H]1CC[C@@](CCOc2cc(F)c(cc2F)S(=O)(=O)Nc2ncns2)(CC1)c1ccccc1