Reaction Details
TargetCytochrome P450 3A4
LigandBDBM50237500
Substrate/Competitorn/a
Meas. Tech.ChEMBL_1660136 (CHEMBL4009748)
IC50 7900±n/a nM
Citation Wu, YJGuernon, JShi, JDitta, JRobbins, KJRajamani, REaston, ANewton, ABourin, CMosure, KSoars, MGKnox, RJMatchett, MPieschl, RLPost-Munson, DJWang, SHerrington, JGraef, JNewberry, KBristow, LJMeanwell, NAOlson, RThompson, LADzierba, C Development of New Benzenesulfonamides As Potent and Selective Na J Med Chem60:2513-2525 (2017) 
 
Cytochrome P450 3A4
Name:Cytochrome P450 3A4
Type:Enzyme
Mol. Mass.:57349.57
Organism:Homo sapiens (Human)
Description:n/a
Residue:503
BDBM50237500
NameBDBM50237500
Synonyms:CHEMBL4096711
TypeSmall organic molecule
Emp. Form.C15H18ClFN4O3S2
Mol. Mass.420.91
SMILESON1CCC[C@H](CNc2cc(F)c(cc2Cl)S(=O)(=O)Nc2nccs2)C1