Reaction Details
TargetSodium channel protein type 9 subunit alpha
LigandBDBM50237505
Substrate/Competitorn/a
Meas. Tech.ChEMBL_1660138 (CHEMBL4009750)
IC50 207±n/a nM
Citation Wu, YJGuernon, JShi, JDitta, JRobbins, KJRajamani, REaston, ANewton, ABourin, CMosure, KSoars, MGKnox, RJMatchett, MPieschl, RLPost-Munson, DJWang, SHerrington, JGraef, JNewberry, KBristow, LJMeanwell, NAOlson, RThompson, LADzierba, C Development of New Benzenesulfonamides As Potent and Selective Na J Med Chem60:2513-2525 (2017) 
 
Sodium channel protein type 9 subunit alpha
Name:Sodium channel protein type 9 subunit alpha
Type:Protein
Mol. Mass.:226375.97
Organism:Homo sapiens (Human)
Description:Q15858
Residue:1988
BDBM50237505
NameBDBM50237505
Synonyms:CHEMBL4072107
TypeSmall organic molecule
Emp. Form.C15H18ClFN4O3S2
Mol. Mass.420.91
SMILESON1CCC[C@@H](CNc2cc(F)c(cc2Cl)S(=O)(=O)Nc2nccs2)C1