Reaction Details
TargetCytochrome P450 3A4
LigandBDBM50237525
Substrate/Competitorn/a
Meas. Tech.ChEMBL_1660136 (CHEMBL4009748)
IC50 6700±n/a nM
Citation Wu, YJGuernon, JShi, JDitta, JRobbins, KJRajamani, REaston, ANewton, ABourin, CMosure, KSoars, MGKnox, RJMatchett, MPieschl, RLPost-Munson, DJWang, SHerrington, JGraef, JNewberry, KBristow, LJMeanwell, NAOlson, RThompson, LADzierba, C Development of New Benzenesulfonamides As Potent and Selective Na J Med Chem60:2513-2525 (2017) 
 
Cytochrome P450 3A4
Name:Cytochrome P450 3A4
Type:Enzyme
Mol. Mass.:57349.57
Organism:Homo sapiens (Human)
Description:n/a
Residue:503
BDBM50237525
NameBDBM50237525
Synonyms:CHEMBL4078252 | US10836758, Example 2
TypeSmall organic molecule
Emp. Form.C16H20ClFN4O2S2
Mol. Mass.418.937
SMILESFc1cc(NCCC2CCCNC2)c(Cl)cc1S(=O)(=O)Nc1nccs1