Reaction Details
TargetCytochrome P450 2C8
LigandBDBM50317426
Substrate/Competitorn/a
Meas. Tech.ChEMBL_1661007 (CHEMBL4010619)
IC50 2200±n/a nM
Citation Kim, HJKim, ISRehman, SUHa, SKNakamura, KYoo, HH Effects of 6-paradol, an unsaturated ketone from gingers, on cytochrome P450-mediated drug metabolism. Bioorg Med Chem Lett27:1826-1830 (2017) 
 
Cytochrome P450 2C8
Name:Cytochrome P450 2C8
Type:Protein
Mol. Mass.:55839.23
Organism:Homo sapiens (Human)
Description:P10632
Residue:490
BDBM50317426
NameBDBM50317426
Synonyms:8-Gingerol | CHEMBL1095671
TypeSmall organic molecule
Emp. Form.C19H30O4
Mol. Mass.322.4391
SMILESCCCCCCC[C@H](O)CC(=O)CCc1ccc(O)c(OC)c1