Reaction Details
TargetCytochrome P450 3A4
LigandBDBM50317425
Substrate/Competitorn/a
Meas. Tech.ChEMBL_1661018 (CHEMBL4010630)
IC50 24900±n/a nM
Citation Kim, HJKim, ISRehman, SUHa, SKNakamura, KYoo, HH Effects of 6-paradol, an unsaturated ketone from gingers, on cytochrome P450-mediated drug metabolism. Bioorg Med Chem Lett27:1826-1830 (2017) 
 
Cytochrome P450 3A4
Name:Cytochrome P450 3A4
Type:Enzyme
Mol. Mass.:57349.57
Organism:Homo sapiens (Human)
Description:n/a
Residue:503
BDBM50317425
NameBDBM50317425
Synonyms:10-Gingerol | CHEMBL549472
TypeSmall organic molecule
Emp. Form.C21H34O4
Mol. Mass.350.4923
SMILESCCCCCCCCC[C@H](O)CC(=O)CCc1ccc(O)c(OC)c1