Reaction Details
TargetCytochrome P450 3A4
LigandBDBM50275147
Substrate/Competitorn/a
Meas. Tech.ChEMBL_1661018 (CHEMBL4010630)
IC50 42900±n/a nM
Citation Kim, HJKim, ISRehman, SUHa, SKNakamura, KYoo, HH Effects of 6-paradol, an unsaturated ketone from gingers, on cytochrome P450-mediated drug metabolism. Bioorg Med Chem Lett27:1826-1830 (2017) 
 
Cytochrome P450 3A4
Name:Cytochrome P450 3A4
Type:Enzyme
Mol. Mass.:57349.57
Organism:Homo sapiens (Human)
Description:n/a
Residue:503
BDBM50275147
NameBDBM50275147
Synonyms:6-Gingerol CHEMBL446043 [6]-gingerol
TypeSmall organic molecule
Emp. Form.C17H26O4
Mol. Mass.294.3859
SMILESCCCCC[C@H](O)CC(=O)CCc1ccc(O)c(OC)c1