Reaction Details
TargetCytochrome P450 3A4
LigandBDBM50317426
Substrate/Competitorn/a
Meas. Tech.ChEMBL_1661017 (CHEMBL4010629)
IC50 11600±n/a nM
Citation Kim, HJKim, ISRehman, SUHa, SKNakamura, KYoo, HH Effects of 6-paradol, an unsaturated ketone from gingers, on cytochrome P450-mediated drug metabolism. Bioorg Med Chem Lett27:1826-1830 (2017) 
 
Cytochrome P450 3A4
Name:Cytochrome P450 3A4
Type:Enzyme
Mol. Mass.:57349.57
Organism:Homo sapiens (Human)
Description:n/a
Residue:503
BDBM50317426
NameBDBM50317426
Synonyms:8-Gingerol | CHEMBL1095671
TypeSmall organic molecule
Emp. Form.C19H30O4
Mol. Mass.322.4391
SMILESCCCCCCC[C@H](O)CC(=O)CCc1ccc(O)c(OC)c1