Reaction Details
TargetCytochrome P450 2B6
LigandBDBM50237536
Substrate/Competitorn/a
Meas. Tech.ChEMBL_1661006 (CHEMBL4010618)
IC50 5800±n/a nM
Citation Kim, HJKim, ISRehman, SUHa, SKNakamura, KYoo, HH Effects of 6-paradol, an unsaturated ketone from gingers, on cytochrome P450-mediated drug metabolism. Bioorg Med Chem Lett27:1826-1830 (2017) 
 
Cytochrome P450 2B6
Name:Cytochrome P450 2B6
Type:Protein
Mol. Mass.:56289.75
Organism:Homo sapiens (Human)
Description:P20813
Residue:491
BDBM50237536
NameBDBM50237536
Synonyms:6-Shogaol SHOGAOL | Trans-6-Shogaol
TypeSmall organic molecule
Emp. Form.C17H24O3
Mol. Mass.276.3707
SMILESCCCCC\C=C\C(=O)CCc1ccc(O)c(OC)c1