Reaction Details
TargetCytochrome P450 2B6
LigandBDBM50237535
Substrate/Competitorn/a
Meas. Tech.ChEMBL_1661000 (CHEMBL4010612)
IC50 6200±n/a nM
Citation Kim, HJKim, ISRehman, SUHa, SKNakamura, KYoo, HH Effects of 6-paradol, an unsaturated ketone from gingers, on cytochrome P450-mediated drug metabolism. Bioorg Med Chem Lett27:1826-1830 (2017) 
 
Cytochrome P450 2B6
Name:Cytochrome P450 2B6
Type:Protein
Mol. Mass.:56289.75
Organism:Homo sapiens (Human)
Description:P20813
Residue:491
BDBM50237535
NameBDBM50237535
Synonyms:6-Paradol CHEMBL2071440
TypeSmall organic molecule
Emp. Form.C17H26O3
Mol. Mass.278.3865
SMILESCCCCCCCC(=O)CCc1ccc(O)c(OC)c1