Reaction Details
TargetP2Y purinoceptor 4
LigandBDBM50336791
Substrate/Competitorn/a
Meas. Tech.ChEBML_1661636
IC50 2630±n/a nM
Citation Rafehi, MMalik, EMNeumann, AAbdelrahman, AHanck, TNamasivayam, VMüller, CEBaqi, Y Development of Potent and Selective Antagonists for the UTP-Activated P2Y J Med Chem60:3020-3038 (2017) 
 
P2Y purinoceptor 4
Name:P2Y purinoceptor 4
Type:PROTEIN
Mol. Mass.:40977.17
Organism:Homo sapiens (Human)
Description:ChEMBL_751027
Residue:365
BDBM50336791
NameBDBM50336791
Synonyms:CHEMBL402239 | sodium 1-amino-4-(2,3-dimethylphenylamino)-9,10-dioxo-9,10-dihydroanthracene-2-sulfonate
TypeSmall organic molecule
Emp. Form.C22H17N2O5S
Mol. Mass.421.446
SMILESCc1cccc(Nc2cc(c(N)c3C(=O)c4ccccc4C(=O)c23)S([O-])(=O)=O)c1C