Reaction Details
TargetP2Y purinoceptor 4
LigandBDBM50237559
Substrate/Competitorn/a
Meas. Tech.ChEBML_1661636
IC50 4980±n/a nM
Citation Rafehi, MMalik, EMNeumann, AAbdelrahman, AHanck, TNamasivayam, VMüller, CEBaqi, Y Development of Potent and Selective Antagonists for the UTP-Activated P2Y J Med Chem60:3020-3038 (2017) 
 
P2Y purinoceptor 4
Name:P2Y purinoceptor 4
Type:PROTEIN
Mol. Mass.:40977.17
Organism:Homo sapiens (Human)
Description:ChEMBL_751027
Residue:365
BDBM50237559
NameBDBM50237559
Synonyms:CHEMBL4063599
TypeSmall organic molecule
Emp. Form.C22H17N2NaO7S
Mol. Mass.476.434
SMILES[Na+].COc1ccc(Nc2cc(c(N)c3C(=O)c4ccccc4C(=O)c23)S([O-])(=O)=O)cc1OC