Reaction Details
TargetP2Y purinoceptor 1
LigandBDBM50237577
Substrate/Competitorn/a
Meas. Tech.ChEMBL_1661639 (CHEMBL4011251)
IC50 5480±n/a nM
Citation Rafehi, MMalik, EMNeumann, AAbdelrahman, AHanck, TNamasivayam, VMüller, CEBaqi, Y Development of Potent and Selective Antagonists for the UTP-Activated P2Y J Med Chem60:3020-3038 (2017) 
 
P2Y purinoceptor 1
Name:P2Y purinoceptor 1
Type:Enzyme
Mol. Mass.:42090.25
Organism:Homo sapiens (Human)
Description:P47900
Residue:373
BDBM50237577
NameBDBM50237577
Synonyms:CHEMBL4087247
TypeSmall organic molecule
Emp. Form.C28H21N2NaO5S2
Mol. Mass.552.597
SMILES[Na+].Cc1ccc(Sc2ccc(Nc3cc(c(N)c4C(=O)c5ccccc5C(=O)c34)S([O-])(=O)=O)cc2)c(C)c1