Reaction Details
TargetP2Y purinoceptor 1
LigandBDBM50237576
Substrate/Competitorn/a
Meas. Tech.ChEMBL_1661639 (CHEMBL4011251)
IC50 7650±n/a nM
Citation Rafehi, MMalik, EMNeumann, AAbdelrahman, AHanck, TNamasivayam, VMüller, CEBaqi, Y Development of Potent and Selective Antagonists for the UTP-Activated P2Y J Med Chem60:3020-3038 (2017) 
 
P2Y purinoceptor 1
Name:P2Y purinoceptor 1
Type:Enzyme
Mol. Mass.:42090.25
Organism:Homo sapiens (Human)
Description:P47900
Residue:373
BDBM50237576
NameBDBM50237576
Synonyms:CHEMBL4069492
TypeSmall organic molecule
Emp. Form.C21H15N2NaO6S
Mol. Mass.446.408
SMILES[Na+].Cc1cc(Nc2cc(c(N)c3C(=O)c4ccccc4C(=O)c23)S([O-])(=O)=O)ccc1O