Reaction Details
TargetP2Y purinoceptor 6
LigandBDBM50237587
Substrate/Competitorn/a
Meas. Tech.ChEMBL_1661642 (CHEMBL4011254)
IC50 4360±n/a nM
Citation Rafehi, MMalik, EMNeumann, AAbdelrahman, AHanck, TNamasivayam, VMüller, CEBaqi, Y Development of Potent and Selective Antagonists for the UTP-Activated P2Y J Med Chem60:3020-3038 (2017) 
 
P2Y purinoceptor 6
Name:P2Y purinoceptor 6
Type:PROTEIN
Mol. Mass.:36452.29
Organism:Homo sapiens (Human)
Description:ChEMBL_1511151
Residue:328
BDBM50237587
NameBDBM50237587
Synonyms:CHEMBL4099292
TypeSmall organic molecule
Emp. Form.C28H21N2NaO5S2
Mol. Mass.552.597
SMILES[Na+].Cc1ccc(Sc2ccc(Nc3cc(c(N)c4C(=O)c5ccccc5C(=O)c34)S([O-])(=O)=O)cc2)cc1C