Reaction Details
TargetP2Y purinoceptor 4
LigandBDBM50237575
Substrate/Competitorn/a
Meas. Tech.ChEMBL_1661636 (CHEMBL4011248)
IC50 373±n/a nM
Citation Rafehi, MMalik, EMNeumann, AAbdelrahman, AHanck, TNamasivayam, VMüller, CEBaqi, Y Development of Potent and Selective Antagonists for the UTP-Activated P2Y J Med Chem60:3020-3038 (2017) 
 
P2Y purinoceptor 4
Name:P2Y purinoceptor 4
Type:PROTEIN
Mol. Mass.:40977.17
Organism:Homo sapiens (Human)
Description:ChEMBL_751027
Residue:365
BDBM50237575
NameBDBM50237575
Synonyms:CHEMBL4094930
TypeSmall organic molecule
Emp. Form.C26H16ClN2NaO6S
Mol. Mass.542.923
SMILES[Na+].Nc1c2C(=O)c3ccccc3C(=O)c2c(Nc2ccc(Oc3ccc(Cl)cc3)cc2)cc1S([O-])(=O)=O