Reaction Details
TargetP2Y purinoceptor 4
LigandBDBM50307835
Substrate/Competitorn/a
Meas. Tech.ChEMBL_1661636 (CHEMBL4011248)
IC50>100000±n/a nM
Citation Rafehi, MMalik, EMNeumann, AAbdelrahman, AHanck, TNamasivayam, VMüller, CEBaqi, Y Development of Potent and Selective Antagonists for the UTP-Activated P2Y J Med Chem60:3020-3038 (2017) 
 
P2Y purinoceptor 4
Name:P2Y purinoceptor 4
Type:PROTEIN
Mol. Mass.:40977.17
Organism:Homo sapiens (Human)
Description:ChEMBL_751027
Residue:365
BDBM50307835
NameBDBM50307835
Synonyms:CHEMBL590956 | Sodium 1-amino-4-[4-fluoro-2-carboxyphenylamino]-9,10-dioxo-9,10-dihydroanthracene-2-sulfonate
TypeSmall organic molecule
Emp. Form.C21H12FN2O7S
Mol. Mass.455.393
SMILESNc1c(cc(Nc2ccc(F)cc2C(O)=O)c2C(=O)c3ccccc3C(=O)c12)S([O-])(=O)=O