Reaction Details
TargetBile salt export pump
LigandBDBM50088494
Substrate/Competitorn/a
Meas. Tech.ChEMBL_1661982 (CHEMBL4011663)
IC50 5900±n/a nM
Citation Morgan, RETrauner, Mvan Staden, CJLee, PHRamachandran, BEschenberg, MAfshari, CAQualls, CWLightfoot-Dunn, RHamadeh, HK Interference with bile salt export pump function is a susceptibility factor for human liver injury in drug development. Toxicol Sci118:485-500 (2010) 
 
Bile salt export pump
Name:Bile salt export pump
Type:Protein
Mol. Mass.:146405.49
Organism:Homo sapiens (Human)
Description:O95342
Residue:1321
BDBM50088494
NameBDBM50088494
Synonyms:BDBM50101974 CI-991 GR-92132X Prelay TROGLITAZONE
TypeSmall organic molecule
Emp. Form.C24H27NO5S
Mol. Mass.441.54
SMILESCc1c(C)c2OC(C)(COc3ccc(CC4SC(=O)NC4=O)cc3)CCc2c(C)c1O