Reaction Details
TargetBile salt export pump
LigandBDBM50007664
Substrate/Competitorn/a
Meas. Tech.ChEMBL_1661982 (CHEMBL4011663)
IC50 25000±n/a nM
Citation Morgan, RETrauner, Mvan Staden, CJLee, PHRamachandran, BEschenberg, MAfshari, CAQualls, CWLightfoot-Dunn, RHamadeh, HK Interference with bile salt export pump function is a susceptibility factor for human liver injury in drug development. Toxicol Sci118:485-500 (2010) 
 
Bile salt export pump
Name:Bile salt export pump
Type:Protein
Mol. Mass.:146405.49
Organism:Homo sapiens (Human)
Description:O95342
Residue:1321
BDBM50007664
NameBDBM50007664
Synonyms:7-chloro-2-methylamino-5-phenyl-3H-1,4-benzodiazepin-4-oxide CDP CHLORDIAZEPOXIDE methaminodiazepoxide
TypeSmall organic molecule
Emp. Form.C16H14ClN3O
Mol. Mass.299.755
SMILESCNC1=Nc2ccc(Cl)cc2C(c2ccccc2)=[N+]([O-])C1